llvm.lists.linux.dev archive mirror
 help / color / mirror / Atom feed
[PATCH] iio: frequency: adrf6780: Fix adrf6780_spi_{read,write}()
 2021-10-24 11:14 UTC  (3+ messages)

i386: tinyconfig: perf_event.h:838:21: error: invalid output size for constraint '=q'
 2021-10-24  2:35 UTC 

❌ FAIL: Test report for kernel 5.15.0-rc6 (mainline.kernel.org-clang, 64222515)
 2021-10-22 21:57 UTC 

next/master build: 229 builds: 43 failed, 186 passed, 492 errors, 244 warnings (next-20211022)
 2021-10-22 10:56 UTC 

[char-misc:char-misc-testing 49/54] include/linux/firmware/xlnx-zynqmp.h:634:71: error: expected ';' after top level declarator
 2021-10-22  8:31 UTC  (4+ messages)

[PATCH] compiler_types: mark __compiletime_assert failure as __noreturn
 2021-10-21 23:20 UTC  (2+ messages)

[PATCH v2 2/6] RDMA/siw: Make use of the helper macro kthread_run_on_cpu()
 2021-10-21 22:56 UTC 

[PATCH] Compiler Attributes: remove GCC 5.1 mention
 2021-10-21 22:48 UTC  (2+ messages)

[PATCH] soc/tegra: fuse: Fix bitwise vs. logical OR warning
 2021-10-21 21:55 UTC  (2+ messages)

[PATCH] lib: zstd: Add cast to silence clang's -Wbitwise-instead-of-logical
 2021-10-21 20:23 UTC 

[PATCH v3 06/13] ext4: move quota configuration out of handle_mount_opt()
 2021-10-21 19:57 UTC 

[PATCH bpf-next] samples: bpf: Suppress readelf stderr when probing for BTF support
 2021-10-21 19:21 UTC  (2+ messages)

[PATCH v5 12/21] drm/bridge: ps8640: Register and attach our DSI device at probe
 2021-10-21 18:40 UTC 

[PATCH] mm/memory_failure: Initialize extra_pins in me_pagecache_clean()
 2021-10-21 18:15 UTC  (2+ messages)

[RFC PATCH v2 3/3] mm/mempolicy: wire up syscall set_mempolicy_home_node
 2021-10-21 16:44 UTC  (3+ messages)

[PATCH v3 2/2] mm/vmalloc: introduce alloc_pages_bulk_array_mempolicy to accelerate memory allocation
 2021-10-21 16:05 UTC 

drivers/gpu/drm/i915/i915_sw_fence.c:90:20: error: unused function 'debug_fence_init_onstack'
 2021-10-21 14:38 UTC 

[PATCH] compiler-gcc.h: Define __SANITIZE_ADDRESS__ under hwaddress sanitizer
 2021-10-21 13:50 UTC  (8+ messages)

[PATCH] regulator: lp872x: Remove lp872x_dvs_state
 2021-10-21 13:42 UTC  (2+ messages)

[PATCH mptcp-next] Squash to "mptcp: infinite mapping receiving"
 2021-10-21 13:42 UTC 

[linux-next:master 8693/9489] drivers/mmc/host/sdhci-omap.c:1450:21: error: use of undeclared identifier 'sdhci_omap_runtime_suspend'; did you mean '__pm_runtime_suspend'?
 2021-10-21 12:34 UTC  (2+ messages)

❌ FAIL: Test report for kernel 5.15.0-rc6 (mainline.kernel.org-clang, 2f111a6f)
 2021-10-21 11:59 UTC 

[PATCH v2] uapi: futex: Add a futex syscall
 2021-10-21 11:54 UTC 

[PATCH] ice: Fix clang -Wimplicit-fallthrough in ice_pull_qvec_from_rc()
 2021-10-21 11:45 UTC  (3+ messages)
` [Intel-wired-lan] "

[drm-intel:drm-intel-gt-next 5/10] drivers/gpu/drm/i915/gem/i915_gem_dmabuf.c:248:3: error: implicit declaration of function 'wbinvd_on_all_cpus'
 2021-10-21 11:23 UTC 

[dhowells-fs:fscache-rewrite-indexing-2 12/39] fs/cifs/cifs_swn.c:15:10: fatal error: 'fscache_old.h' file not found
 2021-10-21 10:52 UTC 

next/master build: 230 builds: 37 failed, 193 passed, 479 errors, 276 warnings (next-20211021)
 2021-10-21 10:44 UTC 

[PATCH 0/2] gcc-plugins: Explicitly document purpose and deprecation schedule
 2021-10-21 10:28 UTC  (13+ messages)
` [PATCH 1/2] "
` [PATCH 2/2] gcc-plugins: Remove cyc_complexity

[PATCH v5 00/15] x86: Add support for Clang CFI
 2021-10-21 10:27 UTC  (13+ messages)
` [PATCH v5 03/15] linkage: Add DECLARE_NOT_CALLED_FROM_C

[PATCH v2 0/4] compat vdso cleanups
 2021-10-21 10:05 UTC  (13+ messages)
` [PATCH v2 1/4] arm64: vdso32: drop the test for dmb ishld
` [PATCH v2 2/4] arm64: vdso32: drop test for -march=armv8-a
` [PATCH v2 3/4] arm64: vdso32: suppress error message for 'make mrproper'
` [PATCH v2 4/4] arm64: vdso32: require CROSS_COMPILE_COMPAT for gcc+bfd

[PATCH 3/3] bpf: Implement prealloc for task_local_storage
 2021-10-21  9:50 UTC 

❌ FAIL: Test report for kernel 5.15.0-rc6 (mainline.kernel.org-clang, 8e37395c)
 2021-10-21  8:41 UTC 

[linux-next:master 4870/10297] ld.lld: error: section .dynamic file range overlaps with .text
 2021-10-21  8:22 UTC 

[ardb:arm-vmap-stacks 5/20] arch/arm/mm/context.c:112:28: error: no member named 'task' in 'struct thread_info'
 2021-10-21  7:19 UTC  (4+ messages)

[PATCH v4 3/4] drivers/acpi: Introduce Platform Firmware Runtime Update Telemetry
 2021-10-21  6:37 UTC 

[PATCH 04/22] usb: host: ehci-omap: deny IRQ0
 2021-10-21  6:28 UTC 

[net-next] tcp: don't free a FIN sk_buff in tcp_remove_empty_skb()
 2021-10-21  5:35 UTC 

[PATCH 13/18] mtd: nand: mxic-ecc: Support SPI pipelined mode
 2021-10-21  5:22 UTC 

[tj-misc:bpf-task-local-storage-prealloc 3/3] kernel/bpf/bpf_task_storage.c:371:20: error: use of undeclared identifier 'task_storage_map_ops'
 2021-10-21  0:57 UTC 

[PATCH] [v3] tracing: use %ps format string to print symbols
 2021-10-21  0:35 UTC  (2+ messages)

[intel-tdx:guest 53/136] arch/x86/kernel/acpi/boot.c:366:2: error: call to __compiletime_assert_231 declared with 'error' attribute: Need native word sized stores/loads for atomicity
 2021-10-21  0:03 UTC 

[PATCH v2 2/4] arm64: dts: qcom: sc7280: add display dt nodes
 2021-10-20 20:30 UTC 

[RFC PATCH] mm, slob: Rewrite SLOB using segregated free list
 2021-10-20 20:22 UTC 

Oct 20 2021 meeting notes
 2021-10-20 19:50 UTC 

[PATCH 18/18] spi: mxic: Add support for pipelined ECC operations
 2021-10-20 19:39 UTC 

next/master build: 222 builds: 35 failed, 187 passed, 461 errors, 273 warnings (next-20211020)
 2021-10-20 19:34 UTC 

[PATCH v1] hugetlb: Add hugetlb.*.numa_stat file
 2021-10-20 18:41 UTC 

[mark:irq/handle-domain-irq 2/10] kernel/irq/handle.c:235:25: warning: no previous prototype for function 'generic_handle_arch_irq'
 2021-10-20 16:19 UTC 

[pdx86-platform-drivers-x86:review-hans 77/87] ld.lld: error: undefined symbol: battery_hook_unregister
 2021-10-20 16:09 UTC 

[PATCH 1/2] riscv: consolidate __ex_table construction
 2021-10-20 14:03 UTC  (2+ messages)

[PATCH] platform/chrome: cros_ec: Make cros_ec_unregister() return void
 2021-10-20 13:28 UTC 

[rppt-memblock:for-kernelci 2/2] drivers/of/of_reserved_mem.c:49:3: error: implicit declaration of function 'kmemleak_free_part_phys'
 2021-10-20 11:17 UTC 

[helgaas-pci:for-linus 1/1] arch/x86/include/asm/pci_x86.h:142:8: warning: '__gnu_inline__' attribute only applies to functions
 2021-10-20  9:01 UTC  (2+ messages)

[PATCH] [v2] mlx5: stop warning for 64KB pages
 2021-10-20  8:39 UTC  (2+ messages)

[PATCH] staging: wlan-ng: Avoid bitwise vs logical OR warning in hfa384x_usb_throttlefn()
 2021-10-20  8:14 UTC  (5+ messages)

[PATCH 1/2] rbtree: Expose a test tree to userspace
 2021-10-20  6:46 UTC 

[intel-tdx:guest 122/136] kernel/dma/swiotlb.c:540:28: error: unused function 'area_end'
 2021-10-20  5:57 UTC 

[helgaas-pci:for-linus 1/1] arch/x86/include/asm/pci_x86.h:99:8: error: unknown type name 'raw_spinlock_t'
 2021-10-20  5:55 UTC 

[PATCH] btrfs: fix deadlock when defragging transparent huge pages
 2021-10-20  2:22 UTC 

[peterz-queue:objtool/core 42/43] arch/x86/net/bpf_jit_comp32.c:1367:20: error: use of undeclared identifier '__x86_indirect_thunk_edx'
 2021-10-20  1:42 UTC 

[osandov:btrfs-thp-defrag-fix 1/1] fs/btrfs/ioctl.c:1083:10: warning: incompatible integer to pointer conversion returning 'int' from a function with result type 'struct page *'
 2021-10-20  1:38 UTC 

💥 PANICKED: Test report for kernel 5.15.0-rc6 (mainline.kernel.org-clang, d9abdee5)
 2021-10-20  0:54 UTC 

[PATCH v2] Add payload to be 32-bit aligned to fix dropped packets
 2021-10-20  0:27 UTC 

[PATCH binder] binder: remove duplicate include in binder.c
 2021-10-19 22:51 UTC 

[rostedt-trace:ftrace/core 57/59] kernel/trace/ftrace.c:5608:2: warning: unused label 'out_unlock'
 2021-10-19 19:38 UTC 

[PATCH] [RFC] x86: avoid -mtune=atom with clang
 2021-10-19 19:01 UTC  (2+ messages)

[PATCH] bus: mhi: Add mhi_prepare_for_transfer_autoqueue API for DL auto queue
 2021-10-19 18:02 UTC 

[PATCH] regulator: lp872x: fix enum conversion warning
 2021-10-19 17:40 UTC  (2+ messages)

[PATCH] platform/x86: thinkpad_acpi: Fix bitwise vs. logical warning
 2021-10-19 17:35 UTC  (9+ messages)

[ti:ti-rt-linux-5.10.y 7475/10054] net/core/sock.c:3179:28: error: use of undeclared identifier 'SCM_REDUNDANT'
 2021-10-19 16:02 UTC 

[PATCH] [v2] tracing: use %ps format string to print symbols
 2021-10-19 15:32 UTC  (3+ messages)

[ti:ti-rt-linux-5.10.y 7474/10054] net/socket.c:861:5: error: use of undeclared identifier 'SCM_RED_TIMESTAMPING'
 2021-10-19 14:41 UTC 

[v2 PATCH] crypto: api - Fix built-in testing dependency failures
 2021-10-19 13:28 UTC  (6+ messages)
            ` [PATCH] crypto: api - Do not create test larvals if manager is disabled

[PATCH -next v3 4/5] ext4: simplify read_mmp_block fucntion
 2021-10-19 13:13 UTC 

[PATCH v3 2/2] firmware: arm_scmi: Add optee transport
 2021-10-19 12:50 UTC 

[PATCH v4] spi: spi-geni-qcom: Add support for GPI dma
 2021-10-19 12:04 UTC 

next/master build: 218 builds: 31 failed, 187 passed, 303 errors, 228 warnings (next-20211019)
 2021-10-19 11:54 UTC 

[linux-next:master 4131/8410] drivers/media/platform/mtk-vcodec/mtk_vcodec_dec_stateless.c:133:18: warning: Value stored to 'pfb' during its initialization is never read [clang-analyzer-deadcode.DeadStores]
 2021-10-19  8:55 UTC  (2+ messages)

[djwong-xfs:vectorized-scrub 196/308] fs/xfs/libxfs/xfs_alloc.c:2564:3: warning: Value stored to 'agno' is never read [clang-analyzer-deadcode.DeadStores]
 2021-10-19  8:01 UTC 

[PATCH v1 2/3] ACPI: PM: Fix sharing of wakeup power resources
 2021-10-19  7:29 UTC 

[PATCH v1 2/3] ACPI: PM: Fix sharing of wakeup power resources
 2021-10-19  7:25 UTC 

[jic23-iio:testing 176/178] drivers/mux/core.c:391: warning: expecting prototype for mux_control_try_select(). Prototype was for mux_control_try_select_delay() instead
 2021-10-19  4:51 UTC 

[tnguy-next-queue:dev-queue 53/129] ld.lld: error: main.c:(function do_one_initcall: .text+0x47C): relocation R_RISCV_HI20 out of range: 527042 is not in
 2021-10-19  0:25 UTC 

[PATCH v2 2/3] scsi: target: iscsi: extract auth functions
 2021-10-18 23:18 UTC 

[PATCH 0/3] compat vdso cleanups
 2021-10-18 22:58 UTC  (8+ messages)
` [PATCH 2/3] arm64: vdso32: lazily invoke COMPAT_CC
` [PATCH 3/3] arm64: vdso32: require CROSS_COMPILE_COMPAT for gcc+bfd

[arm-perf:kvm/mm-hacking 20/22] arch/arm64/kvm/hyp/nvhe/hyp-main.c:40:6: warning: no previous prototype for function 'put_shadow_vcpu'
 2021-10-18 22:20 UTC 

[mcgrof-next:20211011-for-axboe-add-disk-error-handling 24/24] drivers/nvdimm/pmem.c:535:2: warning: ignoring return value of function declared with 'warn_unused_result' attribute
 2021-10-18 22:11 UTC 

[dhowells-fs:fscache-rewrite-indexing 77/77] fs/cifs/fscache.h:103:38: error: redefinition of 'cifs_inode_cookie'
 2021-10-18 22:08 UTC 

[PATCH] scsi: be2iscsi: Replace irq_poll with threaded IRQ handler
 2021-10-18 22:08 UTC 

[PATCH] nfp: bpf: Fix bitwise vs. logical OR warning
 2021-10-18 21:54 UTC  (4+ messages)

[PATCH 2/2] kasan: use fortified strings for hwaddress sanitizer
 2021-10-18 20:09 UTC  (3+ messages)

[dhowells-fs:fscache-rewrite-indexing 77/77] fs/cifs/cifsfs.c:401:42: error: too many arguments to function call, expected single argument 'inode', have 2 arguments
 2021-10-18 19:57 UTC 

Some potentially uninitialized values in pid_list_refill_irq()
 2021-10-18 19:31 UTC  (2+ messages)

❌ FAIL: Test report for kernel 5.15.0-rc5 (mainline.kernel.org-clang, cf52ad5f)
 2021-10-18 19:06 UTC 

[PATCH v13 02/10] PCI: kirin: Add support for a PHY layer
 2021-10-18 18:48 UTC 

[mcgrof-next:20211011-for-axboe-add-disk-error-handling 24/24] drivers/md/md.c:5705:2: warning: ignoring return value of function declared with 'warn_unused_result' attribute
 2021-10-18 18:40 UTC 

❌ FAIL: Test report for kernel 5.15.0-rc6 (mainline.kernel.org-clang, 519d8195)
 2021-10-18 18:33 UTC 

[RFC 2/3] mm/vmalloc: add support for __GFP_NOFAIL
 2021-10-18 18:15 UTC  (2+ messages)

next/master build: 167 builds: 18 failed, 149 passed, 18 errors, 168 warnings (next-20211018)
 2021-10-18 17:30 UTC 

[TCWG CI] Regression caused by llvm: [AArch64] Optimize add/sub with immediate
 2021-10-18 17:18 UTC  (2+ messages)

[rt-devel:linux-5.15.y-rt-rebase 88/154] mm/vmalloc.c:1884:17: error: variable 'cpu' set but not used
 2021-10-18 14:20 UTC 

[PATCH] usb: max-3421: Use driver data instead of maintaining a list of bound devices
 2021-10-18 14:03 UTC 

✅ PASS: Test report for kernel 5.15.0-rc5 (mainline.kernel.org-clang, be9eb2f0)
 2021-10-18 13:59 UTC 

[linux-next:master 8710/9200] drivers/scsi/ufs/ufshcd-pci.c:459:9: error: implicit declaration of function 'ufshcd_system_resume'
 2021-10-18 13:40 UTC 

[linux-next:master 7104/8410] drivers/power/supply/axp288_charger.c:411:8: error: implicit declaration of function 'iosf_mbi_block_punit_i2c_access'
 2021-10-18 13:13 UTC  (2+ messages)

[PATCH] PCI: Remove the unused pci wrappers pci_pool_xxx()
 2021-10-18 12:45 UTC  (2+ messages)

[PATCH linux-next] drm/i915/display: Remove unused variable in the for loop
 2021-10-18 12:14 UTC 

[peterz-queue:locking/core 41/43] kernel/locking/rwsem.c:1023:19: error: variable has incomplete type 'enum owner_state'
 2021-10-18 11:23 UTC  (4+ messages)

❌ FAIL: Test report for kernel 5.15.0-rc5 (mainline.kernel.org-clang, d999ade1)
 2021-10-18 10:33 UTC 

[PATCH] net: bpf: switch over to memdup_user()
 2021-10-18 10:09 UTC 

[PATCH] drm/i915: Avoid bitwise vs logical OR warning in snb_wm_latency_quirk()
 2021-10-18  9:10 UTC  (3+ messages)

[PATCH 2/2] drm/bridge: parade-ps8640: Populate devices on aux-bus
 2021-10-18  8:03 UTC 

[PATCH 6/8] phy: uniphier-pcie: Add dual-phy support for NX1 SoC
 2021-10-18  3:42 UTC 

drivers/media/i2c/ov5648.c:2035:39: warning: taking address of packed member 'handler' of class or structure 'ov5648_ctrls' may result in an unaligned pointer value
 2021-10-18  3:20 UTC 

❌ FAIL: Test report for kernel 5.15.0-rc5 (mainline.kernel.org-clang, 6985c40a)
 2021-10-17 23:15 UTC 

[tglx-devel:x86/fpu-kvm 88/88] arch/x86/kernel/fpu/core.c:281:6: warning: variable 'ret' set but not used
 2021-10-17 20:25 UTC 

[tglx-devel:x86/fpu-kvm 69/88] arch/x86/kernel/fpu/xstate.c:1450:33: error: too few arguments to function call, expected 2, have 1
 2021-10-17 19:44 UTC 

[PATCH] staging: rts5208: ms.c: Remove two udelay calls and use usleep_range instead
 2021-10-17 14:13 UTC 

[linux-next:master 7868/8410] net/netfilter/core.c:353:20: error: unused function 'nf_egress_hook'
 2021-10-17 13:48 UTC  (3+ messages)
` [PATCH nf-next] netfilter: core: Fix clang warnings about unused static inlines

❌ FAIL: Test report for kernel 5.15.0-rc5 (mainline.kernel.org-clang, 304040fb)
 2021-10-17 13:23 UTC 

[saeed:mlx5-queue 6/13] kernel/bpf/verifier.c:3552:11: error: implicit declaration of function 'bpf_ct_is_valid_access'
 2021-10-17 11:13 UTC 

[saeed:mlx5-queue 9/13] net/core/filter.c:7426:1: warning: unused label 'err_out'
 2021-10-17 10:51 UTC 

page: 

This is a public inbox, see mirroring instructions
for how to clone and mirror all data and code used for this inbox;
as well as URLs for NNTP newsgroup(s).